{"text_format":"1","workbook":"xlsx","n_sheets":5,"sheets":["Intro","Annual Compliance ->","WAPC Inputs","WAPC Allowance","Compliance Summary"],"not_rendered":{"charts":0,"images":0,"macros":0,"external_links":0,"defined_names":0,"comments":0,"pivot_tables":0},"unopened":[],"bounds":{"document_bytes":16777216,"sheet_cells":100000,"rows_first":2000,"rows_last":500,"rows_between":2000,"halvings":0,"cell_chars":16384,"cell_head_chars":4096},"cells_cut":0,"cells_raw":0,"read":"whole","date_system":"1900"}

{"sheet":"Intro","index":0,"n_rows":0,"n_cols":0,"rows_kept":0,"cut":false,"hidden":false,"merged":[]}

{"sheet":"Annual Compliance ->","index":1,"n_rows":0,"n_cols":0,"rows_kept":0,"cut":false,"hidden":false,"merged":[]}

{"sheet":"WAPC Inputs","index":2,"n_rows":501,"n_cols":10,"rows_kept":501,"cut":false,"hidden":false,"merged":[[256,1,256,4]]}
["Cell colour meanings"]
[null,"Input cell"]
[null,"Calculation cell"]
[null,"WAPC Compliance Inputs"]
[]
[null,"Model start financial year (t-1)",{"$f":"'Compliance Summary'!C4-1","v":2024}]
[null,"Forecast December Quarter CPI",4.1000000000000002E-2]
[]
[null,"Prices in nbn's Pricing Roadmap ",null,null,{"$f":"$C$6","v":2024},{"$f":"$E$9+1","v":2025},null,"Applicable Individual Price Control","Percentage Tariff Change","Individual Price Control Compliance Status"]
[null,"Roadmap table","Tariff List","Side Constraint Identifier"]
[null,"1.1\t  Flat-Rate Offers","AVC TC-4 100/20 Mbps","Other fixed line and fixed wireless TC-4",55,57.22,null,{"$f":"IFERROR(VLOOKUP(D11,'Compliance Summary'!$B$11:$C$15,2,0),\"n/a\")","v":0.05},{"$f":"IFERROR(F11/E11-1,0)","v":4.0363636363636379E-2},{"$f":"IF(I11<=H11,\"Compliant\",\"Not Compliant\")","v":"Compliant"}]
[null,"1.1\t  Flat-Rate Offers","AVC TC-4 100/40 Mbps","Other fixed line and fixed wireless TC-4",58,60.22,null,{"$f":"IFERROR(VLOOKUP(D12,'Compliance Summary'!$B$11:$C$15,2,0),\"n/a\")","v":0.05},{"$f":"IFERROR(F12/E12-1,0)","v":3.8275862068965605E-2},{"$f":"IF(I12<=H12,\"Compliant\",\"Not Compliant\")","v":"Compliant"}]
[null,"1.1\t  Flat-Rate Offers","AVC TC-4 250/25 Mbps","Other fixed line and fixed wireless TC-4",60,62.22,null,{"$f":"IFERROR(VLOOKUP(D13,'Compliance Summary'!$B$11:$C$15,2,0),\"n/a\")","v":0.05},3.6999999999999922E-2,"Compliant"]
[null,"1.1\t  Flat-Rate Offers","AVC TC-4 250/100 Mbps","Other fixed line and fixed wireless TC-4",100,75,null,{"$f":"IFERROR(VLOOKUP(D14,'Compliance Summary'!$B$11:$C$15,2,0),\"n/a\")","v":0.05},-0.25,"Compliant"]
[null,"1.1\t  Flat-Rate Offers","AVC TC-4 500/200 Mbps","Other fixed line and fixed wireless TC-4",160,100,null,{"$f":"IFERROR(VLOOKUP(D15,'Compliance Summary'!$B$11:$C$15,2,0),\"n/a\")","v":0.05},-0.375,"Compliant"]
[null,"1.1\t  Flat-Rate Offers","AVC TC-4 1000/50 Mbps","Other fixed line and fixed wireless TC-4",70,72.22,null,{"$f":"IFERROR(VLOOKUP(D16,'Compliance Summary'!$B$11:$C$15,2,0),\"n/a\")","v":0.05},3.1714285714285806E-2,"Compliant"]
[null,"1.1\t  Flat-Rate Offers","AVC TC-4 1000/400 Mbps ","Other fixed line and fixed wireless TC-4",230,125,null,{"$f":"IFERROR(VLOOKUP(D17,'Compliance Summary'!$B$11:$C$15,2,0),\"n/a\")","v":0.05},-0.45652173913043481,"Compliant"]
[null,"1.2\t  Flat-Rate Offers - Smart Places","Smart Places - AVC TC-4 100/40 Mbps","Other fixed line and fixed wireless TC-4",58,60.22,null,{"$f":"IFERROR(VLOOKUP(D18,'Compliance Summary'!$B$11:$C$15,2,0),\"n/a\")","v":0.05},3.8275862068965605E-2,"Compliant"]
[null,"1.2\t  Flat-Rate Offers - Smart Places","Smart Places - AVC TC-4 250/100 Mbps","Other fixed line and fixed wireless TC-4",100,75,null,{"$f":"IFERROR(VLOOKUP(D19,'Compliance Summary'!$B$11:$C$15,2,0),\"n/a\")","v":0.05},-0.25,"Compliant"]
[null,"1.2\t  Flat-Rate Offers - Smart Places","Smart Places - AVC TC-4 500/200 Mbps","Other fixed line and fixed wireless TC-4",160,100,null,{"$f":"IFERROR(VLOOKUP(D20,'Compliance Summary'!$B$11:$C$15,2,0),\"n/a\")","v":0.05},-0.375,"Compliant"]
[null,"1.2\t  Flat-Rate Offers - Smart Places","Smart Places - AVC TC-4 1000/400 Mbps ","Other fixed line and fixed wireless TC-4",230,125,null,{"$f":"IFERROR(VLOOKUP(D21,'Compliance Summary'!$B$11:$C$15,2,0),\"n/a\")","v":0.05},-0.45652173913043481,"Compliant"]
[null,"1.3\t  Bundled TC-4 Offers ","AVC TC-4 12/1 12 (Basic Bundled Offer)","Other fixed line and fixed wireless TC-4",12,12,null,{"$f":"IFERROR(VLOOKUP(D22,'Compliance Summary'!$B$11:$C$15,2,0),\"n/a\")","v":0.05},0,"Compliant"]
[null,"1.3\t  Bundled TC-4 Offers ","AVC TC-4 12/1 Mbps bundled","Other fixed line and fixed wireless TC-4",30.56,32.020000000000003,null,{"$f":"IFERROR(VLOOKUP(D23,'Compliance Summary'!$B$11:$C$15,2,0),\"n/a\")","v":0.05},4.7774869109947771E-2,"Compliant"]
[null,"1.3\t  Bundled TC-4 Offers ","AVC TC-4 25/5 Mbps bundled","Entry level TC-4",32.159999999999997,33.47,null,{"$f":"IFERROR(VLOOKUP(D24,'Compliance Summary'!$B$11:$C$15,2,0),\"n/a\")","v":4.1000000000000002E-2},4.0733830845771202E-2,"Compliant"]
[null,"1.3\t  Bundled TC-4 Offers ","AVC TC-4 25/10 Mbps bundled","Other fixed line and fixed wireless TC-4",32.159999999999997,33.47,null,{"$f":"IFERROR(VLOOKUP(D25,'Compliance Summary'!$B$11:$C$15,2,0),\"n/a\")","v":0.05},4.0733830845771202E-2,"Compliant"]
[null,"1.3\t  Bundled TC-4 Offers ","AVC TC-4 50/20 Mbps bundled","Other fixed line and fixed wireless TC-4",51.12,53.6,null,{"$f":"IFERROR(VLOOKUP(D26,'Compliance Summary'!$B$11:$C$15,2,0),\"n/a\")","v":0.05},4.8513302034428829E-2,"Compliant"]
[null,"1.3\t  Bundled TC-4 Offers ","AVC TC-4 AVC TC-4 up to 75/up to 10 Mbps bundled","Other fixed line and fixed wireless TC-4",51.12,53.6,null,{"$f":"IFERROR(VLOOKUP(D27,'Compliance Summary'!$B$11:$C$15,2,0),\"n/a\")","v":0.05},4.8513302034428829E-2,"Compliant"]
[null,"1.4\t  Bundled TC-4 Offers: Smart Places","Smart Places - AVC TC-4 25/10 Mbps bundled","Other fixed line and fixed wireless TC-4",32.159999999999997,33.47,null,{"$f":"IFERROR(VLOOKUP(D28,'Compliance Summary'!$B$11:$C$15,2,0),\"n/a\")","v":0.05},4.0733830845771202E-2,"Compliant"]
[null,"1.4\t  Bundled TC-4 Offers: Smart Places","Smart Places - AVC TC-4 50/20 Mbps bundled","Other fixed line and fixed wireless TC-4",51.12,53.6,null,{"$f":"IFERROR(VLOOKUP(D29,'Compliance Summary'!$B$11:$C$15,2,0),\"n/a\")","v":0.05},4.8513302034428829E-2,"Compliant"]
[null,"1.5  Asymmetric AVC Offers in respect of the NBN Co Satellite Network","AVC TC-4 12/1 Mbps","Satellite AVC TC-4",24,24,null,{"$f":"IFERROR(VLOOKUP(D30,'Compliance Summary'!$B$11:$C$15,2,0),\"n/a\")","v":4.1000000000000002E-2},0,"Compliant"]
[null,"1.5  Asymmetric AVC Offers in respect of the NBN Co Satellite Network","AVC TC-4 25/5 Mbps","Satellite AVC TC-4",27,27,null,{"$f":"IFERROR(VLOOKUP(D31,'Compliance Summary'!$B$11:$C$15,2,0),\"n/a\")","v":4.1000000000000002E-2},0,"Compliant"]
[null,"2.1  Bundled TC-2 Offers ","AVC TC-2 5/5 Mbps","Other services covered by the WAPC",50,50,null,{"$f":"IFERROR(VLOOKUP(D32,'Compliance Summary'!$B$11:$C$15,2,0),\"n/a\")","v":"n/a"},{"$f":"IFERROR(F32/E32-1,0)","v":0},"Compliant"]
[null,"2.1  Bundled TC-2 Offers ","AVC TC-2 10/10 Mbps","Other services covered by the WAPC",131,131,null,{"$f":"IFERROR(VLOOKUP(D33,'Compliance Summary'!$B$11:$C$15,2,0),\"n/a\")","v":"n/a"},{"$f":"IFERROR(F33/E33-1,0)","v":0},{"$f":"IF(I33<=H33,\"Compliant\",\"Not Compliant\")","v":"Compliant"}]
[null,"2.1  Bundled TC-2 Offers ","AVC TC-2 20/20 Mbps","Other services covered by the WAPC",192,172,null,{"$f":"IFERROR(VLOOKUP(D34,'Compliance Summary'!$B$11:$C$15,2,0),\"n/a\")","v":"n/a"},{"$f":"IFERROR(F34/E34-1,0)","v":-0.10416666666666663},{"$f":"IF(I34<=H34,\"Compliant\",\"Not Compliant\")","v":"Compliant"}]
[null,"2.1  Bundled TC-2 Offers ","AVC TC-2 30/30 Mbps","Other services covered by the WAPC",220,175,null,{"$f":"IFERROR(VLOOKUP(D35,'Compliance Summary'!$B$11:$C$15,2,0),\"n/a\")","v":"n/a"},-0.20454545454545459,"Compliant"]
[null,"2.1  Bundled TC-2 Offers ","AVC TC-2 40/40 Mbps","Other services covered by the WAPC",223,175,null,{"$f":"IFERROR(VLOOKUP(D36,'Compliance Summary'!$B$11:$C$15,2,0),\"n/a\")","v":"n/a"},-0.2152466367713004,"Compliant"]
[null,"2.1  Bundled TC-2 Offers ","AVC TC-2 50/50 Mbps","Other services covered by the WAPC",225,175,null,{"$f":"IFERROR(VLOOKUP(D37,'Compliance Summary'!$B$11:$C$15,2,0),\"n/a\")","v":"n/a"},-0.22222222222222221,"Compliant"]
[null,"2.1  Bundled TC-2 Offers ","AVC TC-2 60/60 Mbps","Other services covered by the WAPC",581,175,null,{"$f":"IFERROR(VLOOKUP(D38,'Compliance Summary'!$B$11:$C$15,2,0),\"n/a\")","v":"n/a"},-0.6987951807228916,"Compliant"]
[null,"2.1  Bundled TC-2 Offers ","AVC TC-2 70/70 Mbps","Other services covered by the WAPC",626,175,null,{"$f":"IFERROR(VLOOKUP(D39,'Compliance Summary'!$B$11:$C$15,2,0),\"n/a\")","v":"n/a"},-0.7204472843450479,"Compliant"]
[null,"2.1  Bundled TC-2 Offers ","AVC TC-2 80/80 Mbps","Other services covered by the WAPC",672,175,null,{"$f":"IFERROR(VLOOKUP(D40,'Compliance Summary'!$B$11:$C$15,2,0),\"n/a\")","v":"n/a"},-0.73958333333333326,"Compliant"]
[null,"2.1  Bundled TC-2 Offers ","AVC TC-2 90/90 Mbps","Other services covered by the WAPC",704,175,null,{"$f":"IFERROR(VLOOKUP(D41,'Compliance Summary'!$B$11:$C$15,2,0),\"n/a\")","v":"n/a"},-0.75142045454545459,"Compliant"]
[null,"2.1  Bundled TC-2 Offers ","AVC TC-2 100/100 Mbps","Other services covered by the WAPC",714,175,null,{"$f":"IFERROR(VLOOKUP(D42,'Compliance Summary'!$B$11:$C$15,2,0),\"n/a\")","v":"n/a"},-0.75490196078431371,"Compliant"]
[null,"2.2  Bundled TC-2 Offers: Smart Places ","Smart Places - AVC TC-2 5/5 Mbps","Other services covered by the WAPC",50,50,null,{"$f":"IFERROR(VLOOKUP(D43,'Compliance Summary'!$B$11:$C$15,2,0),\"n/a\")","v":"n/a"},0,"Compliant"]
[null,"2.2  Bundled TC-2 Offers: Smart Places ","Smart Places  - AVC TC-2 10/10 Mbps","Other services covered by the WAPC",131,131,null,{"$f":"IFERROR(VLOOKUP(D44,'Compliance Summary'!$B$11:$C$15,2,0),\"n/a\")","v":"n/a"},0,"Compliant"]
[null,"2.2  Bundled TC-2 Offers: Smart Places ","Smart Places - AVC TC-2 20/20 Mbps","Other services covered by the WAPC",192,172,null,{"$f":"IFERROR(VLOOKUP(D45,'Compliance Summary'!$B$11:$C$15,2,0),\"n/a\")","v":"n/a"},-0.10416666666666663,"Compliant"]
[null,"2.2  Bundled TC-2 Offers: Smart Places ","Smart Places - AVC TC-2 50/50 Mbps","Other services covered by the WAPC",225,175,null,{"$f":"IFERROR(VLOOKUP(D46,'Compliance Summary'!$B$11:$C$15,2,0),\"n/a\")","v":"n/a"},-0.22222222222222221,"Compliant"]
[null,"2.3  Symmetric Access Capacity Offers (TC-1)","AVC TC-1 0.15 Mbps","Other services covered by the WAPC",10,10,null,{"$f":"IFERROR(VLOOKUP(D47,'Compliance Summary'!$B$11:$C$15,2,0),\"n/a\")","v":"n/a"},0,"Compliant"]
[null,"2.3  Symmetric Access Capacity Offers (TC-1)","AVC TC-1 0.3 Mbps","Other services covered by the WAPC",20,20,null,{"$f":"IFERROR(VLOOKUP(D48,'Compliance Summary'!$B$11:$C$15,2,0),\"n/a\")","v":"n/a"},0,"Compliant"]
[null,"2.3  Symmetric Access Capacity Offers (TC-1)","AVC TC-1 0.5 Mbps","Other services covered by the WAPC",33,33,null,{"$f":"IFERROR(VLOOKUP(D49,'Compliance Summary'!$B$11:$C$15,2,0),\"n/a\")","v":"n/a"},0,"Compliant"]
[null,"2.3  Symmetric Access Capacity Offers (TC-1)","AVC TC-1 1 Mbps","Other services covered by the WAPC",66,66,null,{"$f":"IFERROR(VLOOKUP(D50,'Compliance Summary'!$B$11:$C$15,2,0),\"n/a\")","v":"n/a"},0,"Compliant"]
[null,"2.3  Symmetric Access Capacity Offers (TC-1)","AVC TC-1 2 Mbps","Other services covered by the WAPC",132,132,null,{"$f":"IFERROR(VLOOKUP(D51,'Compliance Summary'!$B$11:$C$15,2,0),\"n/a\")","v":"n/a"},0,"Compliant"]
[null,"2.3  Symmetric Access Capacity Offers (TC-1)","AVC TC-1 5 Mbps","Other services covered by the WAPC",330,330,null,{"$f":"IFERROR(VLOOKUP(D52,'Compliance Summary'!$B$11:$C$15,2,0),\"n/a\")","v":"n/a"},0,"Compliant"]
[null,"3.2  Connectivity Virtual Circuit Offers","CVC TC-4 (Satellite)","Other services covered by the WAPC",15.75,15.75,null,{"$f":"IFERROR(VLOOKUP(D53,'Compliance Summary'!$B$11:$C$15,2,0),\"n/a\")","v":"n/a"},0,"Compliant"]
[null,"3.2  Connectivity Virtual Circuit Offers","CVC TC-1","Other services covered by the WAPC",17.5,17.5,null,{"$f":"IFERROR(VLOOKUP(D54,'Compliance Summary'!$B$11:$C$15,2,0),\"n/a\")","v":"n/a"},0,"Compliant"]
[null,"3.2  Connectivity Virtual Circuit Offers","CVC TC-2","Other services covered by the WAPC",17.5,17.5,null,{"$f":"IFERROR(VLOOKUP(D55,'Compliance Summary'!$B$11:$C$15,2,0),\"n/a\")","v":"n/a"},0,"Compliant"]
[null,"4 CVC Class Offers for the NBN Co Satellite Network","CVC Class 0","Satellite CVC TC-4",0,0,null,{"$f":"IFERROR(VLOOKUP(D56,'Compliance Summary'!$B$11:$C$15,2,0),\"n/a\")","v":0},0,"Compliant"]
[null,"4 CVC Class Offers for the NBN Co Satellite Network","CVC Class 1","Satellite CVC TC-4",18,18,null,{"$f":"IFERROR(VLOOKUP(D57,'Compliance Summary'!$B$11:$C$15,2,0),\"n/a\")","v":0},0,"Compliant"]
[null,"4 CVC Class Offers for the NBN Co Satellite Network","CVC Class 2","Satellite CVC TC-4",40,40,null,{"$f":"IFERROR(VLOOKUP(D58,'Compliance Summary'!$B$11:$C$15,2,0),\"n/a\")","v":0},0,"Compliant"]
[null,"5.1  Network to Network Interface Offers ","NNI 1000BaseLX - per NNI Bearer - Recurring","Other services covered by the WAPC",100,100,null,{"$f":"IFERROR(VLOOKUP(D59,'Compliance Summary'!$B$11:$C$15,2,0),\"n/a\")","v":"n/a"},0,"Compliant"]
[null,"5.1  Network to Network Interface Offers ","NNI 10GBaseLR - per NNI Bearer - Recurring","Other services covered by the WAPC",400,400,null,{"$f":"IFERROR(VLOOKUP(D60,'Compliance Summary'!$B$11:$C$15,2,0),\"n/a\")","v":"n/a"},0,"Compliant"]
[null,"5.1  Network to Network Interface Offers ","NNI 100GBaseLR4 - per NNI Bearer - Recurring","Other services covered by the WAPC",2400,2400,null,{"$f":"IFERROR(VLOOKUP(D61,'Compliance Summary'!$B$11:$C$15,2,0),\"n/a\")","v":"n/a"},0,"Compliant"]
[null,"5.1  Network to Network Interface Offers ","NNI 1000BaseEX - per NNI Bearer - Recurring","Other services covered by the WAPC",125,125,null,{"$f":"IFERROR(VLOOKUP(D62,'Compliance Summary'!$B$11:$C$15,2,0),\"n/a\")","v":"n/a"},0,"Compliant"]
[null,"5.1  Network to Network Interface Offers ","NNI 10GBaseER - per NNI Bearer - Recurring","Other services covered by the WAPC",500,500,null,{"$f":"IFERROR(VLOOKUP(D63,'Compliance Summary'!$B$11:$C$15,2,0),\"n/a\")","v":"n/a"},0,"Compliant"]
[null,"5.1  Network to Network Interface Offers ","NNI 100GBaseER4 - per NNI Bearer - Recurring","Other services covered by the WAPC",3000,3000,null,{"$f":"IFERROR(VLOOKUP(D64,'Compliance Summary'!$B$11:$C$15,2,0),\"n/a\")","v":"n/a"},0,"Compliant"]
[null,"5.1  Network to Network Interface Offers ","V-NNI","Other services covered by the WAPC",65,65,null,{"$f":"IFERROR(VLOOKUP(D65,'Compliance Summary'!$B$11:$C$15,2,0),\"n/a\")","v":"n/a"},0,"Compliant"]
[null,"5.1  Network to Network Interface Offers ","NNI Link","Other services covered by the WAPC",0,0,null,{"$f":"IFERROR(VLOOKUP(D66,'Compliance Summary'!$B$11:$C$15,2,0),\"n/a\")","v":"n/a"},0,"Compliant"]
[null,"5.2 10G NNI Starter Offers","10GBaseLR (in single chassis configuration or as one of a pair in a chassis diverse configuration)  – per NNI Bearer","Other services covered by the WAPC",0,200,null,{"$f":"IFERROR(VLOOKUP(D67,'Compliance Summary'!$B$11:$C$15,2,0),\"n/a\")","v":"n/a"},0,"Compliant"]
[null,"5.2 10G NNI Starter Offers","10GBaseER (in single chassis configuration or as one of a pair in a chassis diverse configuration)  – per NNI Bearer","Other services covered by the WAPC",0,250,null,{"$f":"IFERROR(VLOOKUP(D68,'Compliance Summary'!$B$11:$C$15,2,0),\"n/a\")","v":"n/a"},0,"Compliant"]
[null,"6.  Second UNI-V and AVC Offer","Second UNI-V and AVC offer","Other services covered by the WAPC",17.5,17.5,null,{"$f":"IFERROR(VLOOKUP(D69,'Compliance Summary'!$B$11:$C$15,2,0),\"n/a\")","v":"n/a"},0,"Compliant"]
[null,"7.1  Enhanced Fault Service Level Offers ","Enhanced SLA - 12","Other services covered by the WAPC",15,15,null,{"$f":"IFERROR(VLOOKUP(D70,'Compliance Summary'!$B$11:$C$15,2,0),\"n/a\")","v":"n/a"},0,"Compliant"]
[null,"7.1  Enhanced Fault Service Level Offers ","Enhanced SLA - 12 (24/7)","Other services covered by the WAPC",15,15,null,{"$f":"IFERROR(VLOOKUP(D71,'Compliance Summary'!$B$11:$C$15,2,0),\"n/a\")","v":"n/a"},0,"Compliant"]
[null,"7.1  Enhanced Fault Service Level Offers ","Enhanced SLA - 8","Other services covered by the WAPC",25,25,null,{"$f":"IFERROR(VLOOKUP(D72,'Compliance Summary'!$B$11:$C$15,2,0),\"n/a\")","v":"n/a"},0,"Compliant"]
[null,"7.1  Enhanced Fault Service Level Offers ","Enhanced SLA - 8 (24/7)","Other services covered by the WAPC",55,55,null,{"$f":"IFERROR(VLOOKUP(D73,'Compliance Summary'!$B$11:$C$15,2,0),\"n/a\")","v":"n/a"},0,"Compliant"]
[null,"7.1  Enhanced Fault Service Level Offers ","Enhanced SLA - 6","Other services covered by the WAPC",32.5,32.5,null,{"$f":"IFERROR(VLOOKUP(D74,'Compliance Summary'!$B$11:$C$15,2,0),\"n/a\")","v":"n/a"},0,"Compliant"]
[null,"7.1  Enhanced Fault Service Level Offers ","Enhanced SLA - 6 (24/7)","Other services covered by the WAPC",65,65,null,{"$f":"IFERROR(VLOOKUP(D75,'Compliance Summary'!$B$11:$C$15,2,0),\"n/a\")","v":"n/a"},0,"Compliant"]
[null,"7.1  Enhanced Fault Service Level Offers ","Enhanced SLA - 4","Other services covered by the WAPC",40,40,null,{"$f":"IFERROR(VLOOKUP(D76,'Compliance Summary'!$B$11:$C$15,2,0),\"n/a\")","v":"n/a"},0,"Compliant"]
[null,"7.1  Enhanced Fault Service Level Offers ","Enhanced SLA - 4 (24/7)","Other services covered by the WAPC",25,25,null,{"$f":"IFERROR(VLOOKUP(D77,'Compliance Summary'!$B$11:$C$15,2,0),\"n/a\")","v":"n/a"},0,"Compliant"]
[null,"7.2  Enhanced Fault Service Level Offers","Enhanced SLA - 90 days (24/7)","Other services covered by the WAPC",150,150,null,{"$f":"IFERROR(VLOOKUP(D78,'Compliance Summary'!$B$11:$C$15,2,0),\"n/a\")","v":"n/a"},0,"Compliant"]
[null,"7.3 Enhanced Fault Service Level Offers: Smart Places     ","Smart Places - Enhanced SLA - 12","Other services covered by the WAPC",15,15,null,{"$f":"IFERROR(VLOOKUP(D79,'Compliance Summary'!$B$11:$C$15,2,0),\"n/a\")","v":"n/a"},0,"Compliant"]
[null,"7.3 Enhanced Fault Service Level Offers: Smart Places     ","Smart Places - Enhanced SLA - 12 (24/7)","Other services covered by the WAPC",15,15,null,{"$f":"IFERROR(VLOOKUP(D80,'Compliance Summary'!$B$11:$C$15,2,0),\"n/a\")","v":"n/a"},0,"Compliant"]
{"$rows_left_out":422}
{"sheet":"WAPC Allowance","index":3,"n_rows":41,"n_cols":6,"rows_kept":41,"cut":false,"hidden":false,"merged":[]}
[]
[null,"WAPC Allowance Calculations"]
[]
[null,"First financial year in which WAPC applies",2025]
[null,"Phase of the WAPC","CPI constraint"]
[]
[null,"WAPC Allowance",{"$f":"D7-1","v":2024},{"$f":"$C$4","v":2025},{"$f":"D7+1","v":2026},{"$f":"E7+1","v":2027}]
[]
[null,"Forecast December CPI - Table 1: Forecast Table – August 2023 \n(https://www.rba.gov.au/publications/smp/2023/aug/forecasts.html)",null,4.1000000000000002E-2,3.3000000000000002E-2,2.8000000000000001E-2]
[]
[null,"X factor",null,{"$f":"IF($C$5=\"CPI Constraint\",0,#REF!)","v":0},{"$f":"IF($C$5=\"CPI Constraint\",0,#REF!)","v":0},{"$f":"IF($C$5=\"CPI Constraint\",0,#REF!)","v":0}]
[null,"Cost pass through adjustment factor",null,{"$f":"'WAPC Allowance'!D29","v":0},{"$f":"'WAPC Allowance'!E29","v":0},{"$f":"'WAPC Allowance'!F29","v":0}]
[null,"Excess adjustment factor (EM)",null,{"$f":"'WAPC Allowance'!D41","v":0},{"$f":"'WAPC Allowance'!E41","v":0},{"$f":"'WAPC Allowance'!F41","v":0}]
[]
[null,"WAPC Allowance",null,{"$f":"(1+D9)*(1-D11)*(1+D12)*(1+D13)-1","v":4.0999999999999925E-2},{"$f":"(1+E9)*(1-E11)*(1+E12)*(1+E13)-1","v":3.2999999999999918E-2},{"$f":"(1+F9)*(1-F11)*(1+F12)*(1+F13)-1","v":2.8000000000000025E-2}]
[]
[null,"Cost pass-through factor",{"$f":"'WAPC Allowance'!C7","v":2024},{"$f":"'WAPC Allowance'!D7","v":2025},{"$f":"'WAPC Allowance'!E7","v":2026},{"$f":"'WAPC Allowance'!F7","v":2027}]
[]
[null,"Inputs"]
[null,"Cost pass through in previous year",null,null,{"$f":"D27","v":0},{"$f":"E27","v":0}]
[]
[null,"Pass-through amount approved by ACCC"]
[null,"CPI",null,{"$f":"INDEX('WAPC Allowance'!$D$9:$F$9,,MATCH('WAPC Allowance'!D17,'WAPC Allowance'!$D$7:$F$7,0))","v":4.1000000000000002E-2},{"$f":"INDEX('WAPC Allowance'!$D$9:$F$9,,MATCH('WAPC Allowance'!E17,'WAPC Allowance'!$D$7:$F$7,0))","v":3.3000000000000002E-2},{"$f":"INDEX('WAPC Allowance'!$D$9:$F$9,,MATCH('WAPC Allowance'!F17,'WAPC Allowance'!$D$7:$F$7,0))","v":2.8000000000000001E-2}]
[null,"X factor",null,{"$f":"INDEX('WAPC Allowance'!$D$11:$F$11,,MATCH('WAPC Allowance'!D17,'WAPC Allowance'!$D$7:$F$7,0))","v":0},{"$f":"INDEX('WAPC Allowance'!$D$11:$F$11,,MATCH('WAPC Allowance'!E17,'WAPC Allowance'!$D$7:$F$7,0))","v":0},{"$f":"INDEX('WAPC Allowance'!$D$11:$F$11,,MATCH('WAPC Allowance'!F17,'WAPC Allowance'!$D$7:$F$7,0))","v":0}]
[null,"Excess adjustment factor",null,{"$f":"D41","v":0},{"$f":"E41","v":0},{"$f":"F41","v":0}]
[null,"Notional Revenue In Prior Year "]
[null,"Pass through in current year",null,{"$f":"IFERROR(D22/((1+D23)*(1-D24)*(1+D25)*D26),0)","v":0},{"$f":"IFERROR(E22/((1+E23)*(1-E24)*(1+E25)*E26),0)","v":0},{"$f":"IFERROR(F22/((1+F23)*(1-F24)*(1+F25)*F26),0)","v":0}]
[]
[null,"Cost pass-through adjustment factor (PT)",null,{"$f":"(1+D27)/(1+D20)-1","v":0},{"$f":"(1+E27)/(1+E20)-1","v":0},{"$f":"(1+F27)/(1+F20)-1","v":0}]
[]
[null,"Excess adjustment",{"$f":"C17","v":2024},2025,2026,2027]
[]
[null,"Inputs"]
[null,"CPI t-2",null,null,null,{"$f":"D23","v":4.1000000000000002E-2}]
[null,"X factor t-2",null,null,null,{"$f":"D24","v":0}]
[null,"Pass through t-2",null,null,null,{"$f":"D29","v":0}]
[null,"Excess adjustment t-2",null,null,null,0]
[]
[null,"WAP Ratio t-2",null,null,null,1]
[]
[null,"Excess adjustment factor (EM)",null,null,null,{"$f":"MIN(0,((1+F34)*(1-F35)*(1+F36)*(1+F37))/F39-1)","v":0}]

{"sheet":"Compliance Summary","index":4,"n_rows":37,"n_cols":3,"rows_kept":37,"cut":false,"hidden":false,"merged":[]}
[]
[null,"WAPC Summary"]
[]
[null,"Applicable Financial Year for Proposed Tariff List",2025]
[]
[null,"Applicable Price Controls"]
[null,null,"Constraint"]
[null,"Weighted Average Price Cap (WAPC)",{"$f":"HLOOKUP('Compliance Summary'!$C$4,'WAPC Allowance'!$C$7:$F$15,9,0)","v":4.0999999999999925E-2}]
[]
[null,"Individual Price Control Summary"]
[null,"Entry level TC-4",{"$f":"'WAPC Inputs'!$C$7","v":4.1000000000000002E-2}]
[null,"Other fixed line and fixed wireless TC-4",{"$f":"MAX('WAPC Inputs'!$C$7,5%)","v":0.05}]
[null,"Satellite AVC TC-4",{"$f":"'WAPC Inputs'!$C$7","v":4.1000000000000002E-2}]
[null,"Satellite CVC TC-4",0]
[null,"Other services covered by the WAPC","n/a"]
[]
[null,"Indicative Tariff Changes (maximum within each Tariff group)"]
[]
[null,"WAPC Change",{"$f":"SUMPRODUCT('WAPC Inputs'!$F$11:$F$253,'WAPC Inputs'!$E$259:$E$501)/SUMPRODUCT('WAPC Inputs'!$E$11:$E$253,'WAPC Inputs'!$E$259:$E$501)-1","v":4.0963814327649617E-2}]
[]
[null,"Indicative Tariff Change "]
[null,"Entry level TC-4",{"$f":"_xlfn.MAXIFS('WAPC Inputs'!$I$11:$I$253,'WAPC Inputs'!$D$11:$D$253,'Compliance Summary'!$B22)","v":4.0733830845771202E-2}]
[null,"Other fixed line and fixed wireless TC-4",{"$f":"_xlfn.MAXIFS('WAPC Inputs'!$I$11:$I$253,'WAPC Inputs'!$D$11:$D$253,'Compliance Summary'!$B23)","v":4.8513302034428829E-2}]
[null,"Satellite AVC TC-4",{"$f":"_xlfn.MAXIFS('WAPC Inputs'!$I$11:$I$253,'WAPC Inputs'!$D$11:$D$253,'Compliance Summary'!$B24)","v":0}]
[null,"Satellite CVC TC-4",{"$f":"_xlfn.MAXIFS('WAPC Inputs'!$I$11:$I$253,'WAPC Inputs'!$D$11:$D$253,'Compliance Summary'!$B25)","v":0}]
[null,"Other services covered by the WAPC",{"$f":"_xlfn.MAXIFS('WAPC Inputs'!$I$11:$I$253,'WAPC Inputs'!$D$11:$D$253,'Compliance Summary'!$B26)","v":0}]
[]
[null,"Compliance check"]
[]
[null,"Weighted Average Price Cap (WAPC)",{"$f":"IF(C19<=C8,\"Compliant\",\"Not Compliant\")","v":"Compliant"}]
[]
[null,"Individual Price Controls"]
[null,"Entry level TC-4",{"$f":"IF(C22<=C11,\"Compliant\",\"Not Compliant\")","v":"Compliant"}]
[null,"Other fixed line and fixed wireless TC-4",{"$f":"IF(C23<=C12,\"Compliant\",\"Not Compliant\")","v":"Compliant"}]
[null,"Satellite AVC TC-4","Compliant"]
[null,"Satellite CVC TC-4","Compliant"]
[null,"Other services covered by the WAPC","Compliant"]